[Rd] inst/CITATION produced error during Rcmd check <package>

From: Pfaff, Bernhard <Bernhard.Pfaff_at_drkw.com>
Date: Fri 12 Nov 2004 - 03:11:13 EST


Dear list member,

by running Rcmd check on a package where a customised 'CITATION' file should be included instead of the automatically produced one, the following error occurs:

  adding build stamp to DESCRIPTION
  installing NAMESPACE file and metadata   installing R files
  installing inst files
FIND: Parameter format not correct
make[2]: *** [c:/R/packages/urca/inst] Error 2 make[1]: *** [all] Error 2
make: *** [pkg-urca] Error 2
*** Installation of urca failed ***

When I exclude /inst/CITATION from the package sources, no problems/errors are encountered.
Incidentally, the same error occurs on 'Rcmd check VR':

H:\R\Packages>Rcmd check VR
* checking for working latex ... OK

installing R.css in H:/R/Packages/VR.Rcheck

Looks like `H:/R/Packages/VR' is a package bundle

 ERROR
Installation failed.

H:\R\Packages>

Am I doing something wrong? Is the error caused by my OS? Any help or pointers are appreciated.

Best Regards,
Bernhard

Version:
 platform = i386-pc-mingw32
 arch = i386
 os = mingw32
 system = i386, mingw32
 status =
 major = 2
 minor = 0.0
 year = 2004
 month = 10
 day = 04
 language = R

Windows 2000 Professional (build 2195) Service Pack 4.0

Search Path:
 .GlobalEnv, package:methods, package:stats, package:graphics, package:grDevices, package:utils, package:datasets, package:fortunes, Autoloads, package:base



The information contained herein is confidential and is inte...{{dropped}}

R-devel@stat.math.ethz.ch mailing list
https://stat.ethz.ch/mailman/listinfo/r-devel Received on Fri Nov 12 03:27:04 2004

This archive was generated by hypermail 2.1.8 : Fri 18 Mar 2005 - 09:01:26 EST