[Rd] Build error on Mac OS X

From: Herve Pages <hpages_at_fhcrc.org>
Date: Wed 21 Dec 2005 - 23:12:15 GMT


Hi,

The following commands:

> tar zxvf R-devel_2005-12-14.tar.gz
> mv R-devel R-2.3
> cd R-2.3
> ./configure --with-blas='-framework vecLib' --with-lapack
> make

give me the following error on my Mac OS X system:

...
g77 -fno-common -g -O2 -c xxxpr.f -o xxxpr.o

make[3]: *** No rule to make target `-lintl', needed by `libR.dylib'.  Stop.
make[2]: *** [R] Error 2
make[1]: *** [R] Error 1

make: *** [R] Error 1

I don't get that problem with R-devel daily snapshots from before 2005-12-14 and I get it with (almost) all snaphots between 2005-12-14 and today.

> uname -a

Darwin possum2.fhcrc.org 7.9.0 Darwin Kernel Version 7.9.0: Wed Mar 30 20:11:17 PST 2005; root:xnu/xnu-517.12.7.obj~1/RELEASE_PPC Power Macintosh powerpc

Regards,

H.

-- 
------------------------
Hervé Pagès
E-mail: hpages@fhcrc.org
 Phone: (206) 667-5791
   Fax: (206) 667-1319

______________________________________________
R-devel@r-project.org mailing list
https://stat.ethz.ch/mailman/listinfo/r-devel
Received on Thu Dec 22 10:19:29 2005

This archive was generated by hypermail 2.1.8 : Mon 20 Feb 2006 - 03:21:35 GMT