[Rd] Building R (PR#9366)

From: <Julien.Steiner_at_imd.ch>
Date: Wed 15 Nov 2006 - 14:47:05 GMT


Hello,

=20

I get this error when I try to install R-2.4.0 on Solaris 10

=20

Any Assistance would be greatly appreciated

=20

The ./configure thing passed but then on gmake I get :

=20

Undefined                       first referenced

 symbol                             in file

__builtin_isnan                     arithmetic.o

ld: fatal: Symbol referencing errors. No output written to R.bin

collect2: ld returned 1 exit status

gmake[3]: *** [R.bin] Error 1

gmake[3]: Leaving directory

`/usr/local/R_HOME/R-2.4.0/src/main'

gmake[2]: *** [R] Error 2

gmake[2]: Leaving directory

`/usr/local/R_HOME/R-2.4.0/src/main'

gmake[1]: *** [R] Error 1

gmake[1]: Leaving directory `/usr/local/R_HOME/R-2.4.0/src'

gmake: *** [R] Error 1

=20

        [[alternative HTML version deleted]]



R-devel@r-project.org mailing list
https://stat.ethz.ch/mailman/listinfo/r-devel Received on Thu Nov 16 12:38:51 2006

Archive maintained by Robert King, hosted by the discipline of statistics at the University of Newcastle, Australia.
Archive generated by hypermail 2.1.8, at Thu 16 Nov 2006 - 03:30:46 GMT.

Mailing list information is available at https://stat.ethz.ch/mailman/listinfo/r-devel. Please read the posting guide before posting to the list.