[Rd] compilation problem R2.0.0 Linux SuSE8.2 (PR#7263)

From: <patrick.drechsler_at_gmx.net>
Date: Wed 06 Oct 2004 - 04:55:51 EST


Hi,

I just tried to compile the new release today and encountered some problems:

--8<------------------------schnipp------------------------->8---
patrick@trurl:~/src/r-project/R-2.0.0> ./configure > pd.configure.output
patrick@trurl:~/src/r-project/R-2.0.0> make > pd.make.output

/usr/lib/gcc-lib/i486-suse-linux/3.3/../../../../i486-suse-linux/bin/ld: tcltk.so: undefined versioned symbol name _LIB_VERSION@@GLIBC_2.0
/usr/lib/gcc-lib/i486-suse-linux/3.3/../../../../i486-suse-linux/bin/ld: failed to set dynamic section sizes: Bad value
collect2: ld returned 1 exit status
make[5]: *** [tcltk.so] Fehler 1
make[4]: *** [all] Fehler 2
make[3]: *** [all] Fehler 1
make[2]: *** [R] Fehler 1
make[1]: *** [R] Fehler 1

make: *** [R] Fehler 1
patrick@trurl:~/src/r-project/R-2.0.0> make check > pd.make.check.output
make[4]: *** [base-Ex.Rout] Fehler 1
make[3]: *** [test-Examples-Base] Fehler 2
make[2]: *** [test-Examples] Fehler 2
make[1]: *** [test-all-basics] Fehler 1

make: *** [check] Fehler 2
--8<------------------------schnapp------------------------->8---

I had no problems compiling earlier versions. I've attached a zip file with the complete output of the usual procedure of `./configure', `make' and `make check'. Drop me a line in case you need more info.

system: Linux 2.4.20 (SuSE 8.2 Prof)

TIA Patrick

-- 
Die wahren Lebenskünstler sind bereits glücklich, wenn sie nicht
unglücklich sind. (Jean Anouilh)

______________________________________________
R-devel@stat.math.ethz.ch mailing list
https://stat.ethz.ch/mailman/listinfo/r-devel
Received on Wed Oct 06 05:01:11 2004

This archive was generated by hypermail 2.1.8 : Fri 18 Mar 2005 - 09:00:26 EST