[Rd] R CMD check problem

From: Giles Hooker <gjh27_at_cornell.edu>
Date: Fri, 22 Aug 2008 11:21:46 -0400

I have a query after finding an error running Rtools on a Windows machine.

I am trying to build an update to the R fda library using Rtools27 under Windows XP Pro. This is the current fda library on RForge:


Following R CMD build, R CMD check produces the following error in 00Install.out:

installing R.css in F:/work/RForge/fda.Rcheck

make: *** [Rcode0] Error 53
make[2]: *** [zzzfirst] Error 53
make[1]: *** [all] Error 2
make: *** [pkg-fda] Error 2
*** Installation of fda failed ***

Removing 'F:/work/RForge/fda.Rcheck/fda'

Any idea what the problem could be? Note the same procedure runs successfully on two other windows machines. For reference, the PATH environment variable is:

C:\Program Files\SSH Communications Security\SSH Secure Shell;C:\cygwin\bin;C:\Program Files\R\R-2.7.1\bin

The PATH System variable is:

c:\Rtools\bin;c:\Rtools\perl\bin;c:\Rtools\MinGW\bin;C:\watcom-1.3\binnt;C:\watcom-1.3\binw; %GTK_BASEPATH%\bin;C:\Program Files\MiKTeX 2.5\miktex\bin;%systemroot%\system32;%systemroot%;%systemroot%\system32\wbem;c:\program

files\ati technologies\ati control panel;C:\Program 
Files\MATLAB\R2006a\bin\win32;C:\Program Files\ggobi;C:\Program 

Many thanks,


Giles Hooker
Assistant Professor:

Department of Biological Statistics and Computational Biology
Department of Statistical Science
1186 Comstock Hall
Cornell University
Ithaca, NY, 14853

Ph:  (+1 607) 255 1638
Fax: (+1 607) 255 4698

Email:  giles.hooker_at_cornell.edu

R-devel_at_r-project.org mailing list
Received on Sat 23 Aug 2008 - 05:42:29 GMT

Archive maintained by Robert King, hosted by the discipline of statistics at the University of Newcastle, Australia.
Archive generated by hypermail 2.2.0, at Mon 25 Aug 2008 - 16:37:30 GMT.

Mailing list information is available at https://stat.ethz.ch/mailman/listinfo/r-devel. Please read the posting guide before posting to the list.

list of date sections of archive