[R] compilation failed on MacOSX.5 / icc 10.1 / ifort 10.1 / R 2.7.0

From: Mathieu Prevot <mathieu.prevot_at_ens.fr>
Date: Sat, 07 Jun 2008 17:57:25 +0200


I got the following problem when I type make. The error is not enough verbose to me so I can find the problem. Please cc me, I'm not subscribed.


make[4]: `vfonts.so' is up to date.
building system startup profile
building package 'base'
all.R is unchanged
../../../library/base/R/base is unchanged
dyld: lazy symbol binding failed: Symbol not found: _Rf_ScalarString  Referenced from: /Users/mathieuprevot/PRE/R-2.7.0/lib/libR.dylib  Expected in: dynamic lookup

dyld: Symbol not found: _Rf_ScalarString  Referenced from: /Users/mathieuprevot/PRE/R-2.7.0/lib/libR.dylib  Expected in: dynamic lookup

/bin/sh: line 1: 26329 Done                    cat ./makebasedb.R
    26330 Trace/BPT trap          | R_DEFAULT_PACKAGES=NULL LC_ALL=C

../../../bin/R --vanilla --slave > /dev/null
make[3]: *** [all] Error 133
make[2]: *** [R] Error 1
make[1]: *** [R] Error 1

make: *** [R] Error 1

R-help_at_r-project.org mailing list
https://stat.ethz.ch/mailman/listinfo/r-help PLEASE do read the posting guide http://www.R-project.org/posting-guide.html and provide commented, minimal, self-contained, reproducible code. Received on Sat 07 Jun 2008 - 21:12:06 GMT

Archive maintained by Robert King, hosted by the discipline of statistics at the University of Newcastle, Australia.
Archive generated by hypermail 2.2.0, at Sat 07 Jun 2008 - 21:31:01 GMT.

Mailing list information is available at https://stat.ethz.ch/mailman/listinfo/r-help. Please read the posting guide before posting to the list.

list of date sections of archive