[R] make check errors

About this list Date view Thread view Subject view Author view Attachment view

From: Agustin Lobo (alobo@ija.csic.es)
Date: Tue 14 Jan 2003 - 21:24:45 EST


Message-id: <Pine.OSF.3.96.1030114112123.11382B-100000@paleo.ija.csic.es>


After make check in a linux suse7.3
with

./configure --enable-R-shlib --with-blas=/usr/lib/libatlas.a --with-gnome
--with-gnome-includes=/opt/gnome/include --with-gnome-libs=/opt/gnome/lib
--with-libglade-config=/opt/gnome/bin/libglade-config

I run make and make check. I get, at the end:

running strict specific tests
make[3]: Entering directory `/usr/local/R-1.6.2/tests'
running code in 'eval-etc.R' ... OK
comparing 'eval-etc.Rout' to './eval-etc.Rout.save' ...1d0
< WARNING: ignoring environment value of R_HOME
make[3]: *** [eval-etc.Rout] Error 1
make[3]: Leaving directory `/usr/local/R-1.6.2/tests'
make[2]: *** [test-Specific] Error 2
make[2]: Leaving directory `/usr/local/R-1.6.2/tests'
make[1]: *** [test-all-basics] Error 1
make[1]: Leaving directory `/usr/local/R-1.6.2/tests'
make: *** [check] Error 2

What should I do to fix these errors?

Thanks,

Agus

Dr. Agustin Lobo
Instituto de Ciencias de la Tierra (CSIC)
Lluis Sole Sabaris s/n
08028 Barcelona SPAIN
tel 34 93409 5410
fax 34 93411 0012
alobo@ija.csic.es

______________________________________________
R-help@stat.math.ethz.ch mailing list
http://www.stat.math.ethz.ch/mailman/listinfo/r-help


About this list Date view Thread view Subject view Author view Attachment view

This archive was generated by hypermail 2.1.3 : Tue 01 Jul 2003 - 09:11:19 EST