[R] Compile failure on OSX

From: Adam Witney <awitney_at_sgul.ac.uk>
Date: Wed 17 Aug 2005 - 04:38:48 EST


I am trying to compile R-2.1.1 on MacOSX 10.3.9, but the make is failing (I am building it without all the aqua stuff):

./configure --enable-R-shlib --with-lapac make

.... Snip .....

gcc -dynamiclib -L/sw/lib -L/usr/local/lib -install_name /Library/Frameworks/R.framework/Versions/2.1.1/Resources/lib/libRlapack.dyli b -o libRlapack.dylib dlamc.lo dlapack0.lo dlapack1.lo dlapack2.lo dlapack3.lo cmplx.lo cmplxblas.lo
-L/sw/lib/gcc/powerpc-apple-darwin7.9.0/3.4 -lg2c -lSystem ld: Undefined symbols:


/usr/bin/libtool: internal link edit command failed

make[4]: *** [libRlapack.dylib] Error 1
make[3]: *** [R] Error 2
make[2]: *** [R] Error 1
make[1]: *** [R] Error 1

make: *** [R] Error 1

Thanks for any help


This message has been scanned for viruses and
dangerous content by MailScanner, and is
believed to be clean.

R-help@stat.math.ethz.ch mailing list https://stat.ethz.ch/mailman/listinfo/r-help PLEASE do read the posting guide! http://www.R-project.org/posting-guide.html
Received on Wed Aug 17 04:47:54 2005

This archive was generated by hypermail 2.1.8 : Fri 03 Mar 2006 - 03:39:50 EST