R-alpha: More compilation problems

Anthony Ledford (mas2al@mcs.surrey.ac.uk)
Sun, 12 Jan 1997 13:30:25 +0000 (GMT)

Date: Sun, 12 Jan 1997 13:30:25 +0000 (GMT)
From: Anthony Ledford <mas2al@mcs.surrey.ac.uk>
To: r-testers@stat.math.ethz.ch
Subject: R-alpha: More compilation problems

I am trying to build R v0.15 on a SPARC 20 running Solaris.
Configure seems to work without fault, but the make fails at 
the following point:

gcc -g -O -I../include   -c plot.c -o plot.o
plot.c:1539: `llabs' redeclared as different kind of symbol
previous declaration of `llabs'
plot.c:1539: warning: `llabs' was declared `extern' and later `static'
make[2]: *** [plot.o] Error 1
make[2]: Leaving directory
`[ EDITED FOR BREVITY ] RHOMEv0.15/src/main'
make[1]: *** [build] Error 2
make[1]: Leaving directory
make: *** [install] Error 2

Any ideas? 
Dr Anthony Ledford.			26AA21 Department of Mathematical
Email	: A.Ledford@surrey.ac.uk	and Computing Sciences,
Phone   : +44 (0)1483 - 300800 x2643	University of Surrey, 
Fax	: +44 (0)1483 - 259385		Guildford, Surrey, GU2 5XH, UK.

r-testers mailing list -- For info or help, send "info" or "help",
To [un]subscribe, send "[un]subscribe"
(in the "body", not the subject !)  To: r-testers-request@stat.math.ethz.ch